[ROM][LINARO] CyanogenMod 11 Modified Edition [09/09/14]


EraKlon

Members
Nov 28, 2014
7
11
Hello
i just had today my Mi2S and tried to flash the recovery (23/07/14) Philz (ext4/f2fs) but i can't because i get "signature verification failed" from mi-recovery..
Why?
I downloaded it to my pc, renamed "update.zip", transfer in the internal storage..
tried installing also from updater app in tools but nothing changed...
thank you

ps. just tried also with (20/07/14) V2 (f2fs) and nothin.. at 98% i get:
Install update.zip failed!
update.zip signature verification failed
 
Last edited:

davfiala

Members
Aug 20, 2013
545
80
MiRecovery can install signed zips only, MiRecovery is also locked (can't install other recoveries). Flash it via fastboot.
 

EraKlon

Members
Nov 28, 2014
7
11

Alecsandru

Members
May 9, 2014
251
60
install cpuz , quadrant and antutu from marked and post screenshots , we'll tell you if you have a fake model
 

EraKlon

Members
Nov 28, 2014
7
11
Installed and did everything, i did screenshot of every page just to be sure :)
 

Attachments

  • Screenshot_2014-11-28-20-10-32.png
    Screenshot_2014-11-28-20-10-32.png
    121.8 KB · Views: 244
  • Screenshot_2014-11-28-20-11-14.png
    Screenshot_2014-11-28-20-11-14.png
    113.2 KB · Views: 222
  • Screenshot_2014-11-28-20-11-24.png
    Screenshot_2014-11-28-20-11-24.png
    125.2 KB · Views: 225
  • Screenshot_2014-11-28-20-11-30.png
    Screenshot_2014-11-28-20-11-30.png
    114.8 KB · Views: 230
  • Screenshot_2014-11-28-20-11-36.png
    Screenshot_2014-11-28-20-11-36.png
    110.5 KB · Views: 227
  • Screenshot_2014-11-28-20-11-43.png
    Screenshot_2014-11-28-20-11-43.png
    111.2 KB · Views: 226
  • Screenshot_2014-11-28-20-11-49.png
    Screenshot_2014-11-28-20-11-49.png
    125 KB · Views: 218
  • Screenshot_2014-11-28-20-11-59.png
    Screenshot_2014-11-28-20-11-59.png
    101.5 KB · Views: 196
  • Screenshot_2014-11-28-20-12-04.png
    Screenshot_2014-11-28-20-12-04.png
    123.1 KB · Views: 218
  • Screenshot_2014-11-28-20-21-26.png
    Screenshot_2014-11-28-20-21-26.png
    140.3 KB · Views: 227
  • Screenshot_2014-11-28-20-21-48.png
    Screenshot_2014-11-28-20-21-48.png
    148 KB · Views: 219
  • Screenshot_2014-11-28-20-22-01.png
    Screenshot_2014-11-28-20-22-01.png
    151 KB · Views: 200
  • Screenshot_2014-11-28-20-22-05.png
    Screenshot_2014-11-28-20-22-05.png
    131.1 KB · Views: 232
  • Screenshot_2014-11-28-20-22-19.png
    Screenshot_2014-11-28-20-22-19.png
    134 KB · Views: 261
  • Screenshot_2014-11-28-20-22-24.png
    Screenshot_2014-11-28-20-22-24.png
    135.3 KB · Views: 243
  • Screenshot_2014-11-28-20-22-28.png
    Screenshot_2014-11-28-20-22-28.png
    65.9 KB · Views: 222

EraKlon

Members
Nov 28, 2014
7
11
Oh, such a relief! :)
Can be a driver problem?? for the fastboot? i also tried miui tools but it doesn't work

edit

i noticed that i don't have all the drivers (??) in "devices and printer" in "Hardware and sound" in the control panel i saw this
mtp.png

did resolution of problems: it tells me that a driver isn't installed so i click con "Apply correction", then say no driver found:
driver.png


what driver i'm missing?
 
Last edited:

EraKlon

Members
Nov 28, 2014
7
11
i can't, windows don't let me, it tells that he found no driver...
i also tried to update the existing mi2 driver and then it tells me that the driver is updated
driver2.png


in my devices i have these:
devices.png



EDIT

i installed universaladbdriversetup6.msi (found searching drivers for mi2s on google) and then manually added the driver you told me before while the phone was in fastboot and it found the the mi2s correctly!
Thank you a lot i already flashed a new recovery! :)
 
Last edited:

Haubitze88

Members
Apr 4, 2013
86
18
Hi XperianPro
are you still compiling new kernels?
if yes could you create a kernel for Ivans 5.1.1?
i just tried my first time today but no chance there are to much errors for me
best regards Haubitze
 

XperianPro

Members
Oct 26, 2013
648
82
Hi XperianPro
are you still compiling new kernels?
if yes could you create a kernel for Ivans 5.1.1?
i just tried my first time today but no chance there are to much errors for me
best regards Haubitze

You should sync AOSP 5.1.1 first and set it up with repos from MiCode. It should work.
 
  • Like
Reactions: Haubitze88

Haubitze88

Members
Apr 4, 2013
86
18
You should sync AOSP 5.1.1 first and set it up with repos from MiCode. It should work.
It seams i had some problem with the cross Compiler of ndk
I do it just for fun (the first kernel ever) and if i get it to work i will try to ad some more features
Could i take some of your sources if i get it to work?
 

Haubitze88

Members
Apr 4, 2013
86
18
can you tell me what did i wrong?
haubitze@ubuntu:~/android/kernel/Haubitze1$ make -j4 ARCH=arm CROSS_COMPILE=arm-linux-androideabi-
make: arm-linux-androideabi-gcc: Command not found
scripts/kconfig/conf --silentoldconfig Kconfig
make: arm-linux-androideabi-gcc: Command not found
WRAP arch/arm/include/generated/asm/auxvec.h
CHK include/linux/version.h
WRAP arch/arm/include/generated/asm/bitsperlong.h
WRAP arch/arm/include/generated/asm/cputime.h
WRAP arch/arm/include/generated/asm/emergency-restart.h
WRAP arch/arm/include/generated/asm/errno.h
WRAP arch/arm/include/generated/asm/ioctl.h
WRAP arch/arm/include/generated/asm/irq_regs.h
UPD include/linux/version.h
WRAP arch/arm/include/generated/asm/kdebug.h
WRAP arch/arm/include/generated/asm/local.h
WRAP arch/arm/include/generated/asm/percpu.h
WRAP arch/arm/include/generated/asm/local64.h
WRAP arch/arm/include/generated/asm/poll.h
WRAP arch/arm/include/generated/asm/resource.h
WRAP arch/arm/include/generated/asm/siginfo.h
WRAP arch/arm/include/generated/asm/sections.h
WRAP arch/arm/include/generated/asm/simd.h
WRAP arch/arm/include/generated/asm/sizes.h
Building with KERNELRELEASE = 3.4.10
/home/haubitze/android/kernel/Haubitze1/scripts/gcc-version.sh: line 25: arm-linux-androideabi-gcc: command not found
/home/haubitze/android/kernel/Haubitze1/scripts/gcc-version.sh: line 26: arm-linux-androideabi-gcc: command not found
/home/haubitze/android/kernel/Haubitze1/scripts/gcc-version.sh: line 25: arm-linux-androideabi-gcc: command not found
/home/haubitze/android/kernel/Haubitze1/scripts/gcc-version.sh: line 26: arm-linux-androideabi-gcc: command not found
/home/haubitze/android/kernel/Haubitze1/scripts/gcc-version.sh: line 25: arm-linux-androideabi-gcc: command not found
/home/haubitze/android/kernel/Haubitze1/scripts/gcc-version.sh: line 26: arm-linux-androideabi-gcc: command not found
/home/haubitze/android/kernel/Haubitze1/scripts/gcc-version.sh: line 25: arm-linux-androideabi-gcc: command not found
/home/haubitze/android/kernel/Haubitze1/scripts/gcc-version.sh: line 26: arm-linux-androideabi-gcc: command not found
/home/haubitze/android/kernel/Haubitze1/scripts/gcc-version.sh: line 25: arm-linux-androideabi-gcc: command not found
/home/haubitze/android/kernel/Haubitze1/scripts/gcc-version.sh: line 25: arm-linux-androideabi-gcc: command not found
/home/haubitze/android/kernel/Haubitze1/scripts/gcc-version.sh: line 26: arm-linux-androideabi-gcc: command not found
/home/haubitze/android/kernel/Haubitze1/scripts/gcc-version.sh: line 26: arm-linux-androideabi-gcc: command not found
/home/haubitze/android/kernel/Haubitze1/scripts/gcc-version.sh: line 25: arm-linux-androideabi-gcc: command not found
/home/haubitze/android/kernel/Haubitze1/scripts/gcc-version.sh: line 26: arm-linux-androideabi-gcc: command not found
/home/haubitze/android/kernel/Haubitze1/scripts/gcc-version.sh: line 25: arm-linux-androideabi-gcc: command not found
/home/haubitze/android/kernel/Haubitze1/scripts/gcc-version.sh: line 26: arm-linux-androideabi-gcc: command not found
CHK include/generated/utsrelease.h
UPD include/generated/utsrelease.h
HOSTCC scripts/genksyms/genksyms.o
SHIPPED scripts/genksyms/lex.lex.c
SHIPPED scripts/genksyms/keywords.hash.c
SHIPPED scripts/genksyms/parse.tab.h
CC scripts/mod/empty.o
/bin/sh: 1: arm-linux-androideabi-gcc: not found
make[2]: *** [scripts/mod/empty.o] Error 127
make[1]: *** [scripts/mod] Error 2
make[1]: *** Waiting for unfinished jobs....
SHIPPED scripts/genksyms/parse.tab.c
HOSTCC scripts/genksyms/lex.lex.o
HOSTCC scripts/genksyms/parse.tab.o
Generating include/generated/mach-types.h
CC kernel/bounds.s
/bin/sh: 1: arm-linux-androideabi-gcc: not found
make[1]: *** [kernel/bounds.s] Error 127
make: *** [prepare0] Error 2
make: *** Waiting for unfinished jobs....
HOSTLD scripts/genksyms/genksyms
make: *** [scripts] Error 2
 

XperianPro

Members
Oct 26, 2013
648
82
can you tell me what did i wrong?
haubitze@ubuntu:~/android/kernel/Haubitze1$ make -j4 ARCH=arm CROSS_COMPILE=arm-linux-androideabi-
make: arm-linux-androideabi-gcc: Command not found
scripts/kconfig/conf --silentoldconfig Kconfig
make: arm-linux-androideabi-gcc: Command not found
WRAP arch/arm/include/generated/asm/auxvec.h
CHK include/linux/version.h
WRAP arch/arm/include/generated/asm/bitsperlong.h
WRAP arch/arm/include/generated/asm/cputime.h
WRAP arch/arm/include/generated/asm/emergency-restart.h
WRAP arch/arm/include/generated/asm/errno.h
WRAP arch/arm/include/generated/asm/ioctl.h
WRAP arch/arm/include/generated/asm/irq_regs.h
UPD include/linux/version.h
WRAP arch/arm/include/generated/asm/kdebug.h
WRAP arch/arm/include/generated/asm/local.h
WRAP arch/arm/include/generated/asm/percpu.h
WRAP arch/arm/include/generated/asm/local64.h
WRAP arch/arm/include/generated/asm/poll.h
WRAP arch/arm/include/generated/asm/resource.h
WRAP arch/arm/include/generated/asm/siginfo.h
WRAP arch/arm/include/generated/asm/sections.h
WRAP arch/arm/include/generated/asm/simd.h
WRAP arch/arm/include/generated/asm/sizes.h
Building with KERNELRELEASE = 3.4.10
/home/haubitze/android/kernel/Haubitze1/scripts/gcc-version.sh: line 25: arm-linux-androideabi-gcc: command not found
/home/haubitze/android/kernel/Haubitze1/scripts/gcc-version.sh: line 26: arm-linux-androideabi-gcc: command not found
/home/haubitze/android/kernel/Haubitze1/scripts/gcc-version.sh: line 25: arm-linux-androideabi-gcc: command not found
/home/haubitze/android/kernel/Haubitze1/scripts/gcc-version.sh: line 26: arm-linux-androideabi-gcc: command not found
/home/haubitze/android/kernel/Haubitze1/scripts/gcc-version.sh: line 25: arm-linux-androideabi-gcc: command not found
/home/haubitze/android/kernel/Haubitze1/scripts/gcc-version.sh: line 26: arm-linux-androideabi-gcc: command not found
/home/haubitze/android/kernel/Haubitze1/scripts/gcc-version.sh: line 25: arm-linux-androideabi-gcc: command not found
/home/haubitze/android/kernel/Haubitze1/scripts/gcc-version.sh: line 26: arm-linux-androideabi-gcc: command not found
/home/haubitze/android/kernel/Haubitze1/scripts/gcc-version.sh: line 25: arm-linux-androideabi-gcc: command not found
/home/haubitze/android/kernel/Haubitze1/scripts/gcc-version.sh: line 25: arm-linux-androideabi-gcc: command not found
/home/haubitze/android/kernel/Haubitze1/scripts/gcc-version.sh: line 26: arm-linux-androideabi-gcc: command not found
/home/haubitze/android/kernel/Haubitze1/scripts/gcc-version.sh: line 26: arm-linux-androideabi-gcc: command not found
/home/haubitze/android/kernel/Haubitze1/scripts/gcc-version.sh: line 25: arm-linux-androideabi-gcc: command not found
/home/haubitze/android/kernel/Haubitze1/scripts/gcc-version.sh: line 26: arm-linux-androideabi-gcc: command not found
/home/haubitze/android/kernel/Haubitze1/scripts/gcc-version.sh: line 25: arm-linux-androideabi-gcc: command not found
/home/haubitze/android/kernel/Haubitze1/scripts/gcc-version.sh: line 26: arm-linux-androideabi-gcc: command not found
CHK include/generated/utsrelease.h
UPD include/generated/utsrelease.h
HOSTCC scripts/genksyms/genksyms.o
SHIPPED scripts/genksyms/lex.lex.c
SHIPPED scripts/genksyms/keywords.hash.c
SHIPPED scripts/genksyms/parse.tab.h
CC scripts/mod/empty.o
/bin/sh: 1: arm-linux-androideabi-gcc: not found
make[2]: *** [scripts/mod/empty.o] Error 127
make[1]: *** [scripts/mod] Error 2
make[1]: *** Waiting for unfinished jobs....
SHIPPED scripts/genksyms/parse.tab.c
HOSTCC scripts/genksyms/lex.lex.o
HOSTCC scripts/genksyms/parse.tab.o
Generating include/generated/mach-types.h
CC kernel/bounds.s
/bin/sh: 1: arm-linux-androideabi-gcc: not found
make[1]: *** [kernel/bounds.s] Error 127
make: *** [prepare0] Error 2
make: *** Waiting for unfinished jobs....
HOSTLD scripts/genksyms/genksyms
make: *** [scripts] Error 2

Try adding toolchain to path or atleast create symlink of it to bin folder.
 
  • Like
Reactions: Haubitze88

Haubitze88

Members
Apr 4, 2013
86
18
Thx
Toolchain is working now i had to download some more stuff for the build environments in ubuntu
compiling starts but in some steps it get some error so i created a New thread i will try maybe i will get my first self compiled kernel
 
  • Like
Reactions: MSephiroth